<?xml version="1.0" encoding="utf-8"?>
<rss version="2.0" xmlns:atom="http://www.w3.org/2005/Atom">
	<channel>
		<title><![CDATA[wolfSSL - Embedded SSL Library — Error on compiling]]></title>
		<link>https://www.wolfssl.com/forums/topic2281-error-on-compiling.html</link>
		<atom:link href="https://www.wolfssl.com/forums/feed-rss-topic2281.xml" rel="self" type="application/rss+xml" />
		<description><![CDATA[The most recent posts in Error on compiling.]]></description>
		<lastBuildDate>Thu, 20 Feb 2025 22:32:35 +0000</lastBuildDate>
		<generator>PunBB</generator>
		<item>
			<title><![CDATA[Re: Error on compiling]]></title>
			<link>https://www.wolfssl.com/forums/post8221.html#p8221</link>
			<description><![CDATA[<p>Hi Fred,</p><p>When you build wolfssl use ./configure --enable-wolfssh. That will include this `wc_SSH_KDF` API. Please let us know if that does not help. See: <a href="https://github.com/wolfSSL/wolfssh?tab=readme-ov-file#dependencies">https://github.com/wolfSSL/wolfssh?tab= … pendencies</a></p><p>Thanks,<br />David Garske, wolfSSL</p>]]></description>
			<author><![CDATA[null@example.com (dgarske)]]></author>
			<pubDate>Thu, 20 Feb 2025 22:32:35 +0000</pubDate>
			<guid>https://www.wolfssl.com/forums/post8221.html#p8221</guid>
		</item>
		<item>
			<title><![CDATA[Error on compiling]]></title>
			<link>https://www.wolfssl.com/forums/post8220.html#p8220</link>
			<description><![CDATA[<p>Hello,</p><p>Thank you for your work and ressources.</p><p>I try to compile and test your ssh delivery following instructions you prepared on old macbook pro running macos Big Sur 11.7.10.</p><p>I started <br />to clone wolfssl<br />to build it following autotools steps with success I guess<br />to clone solfssh<br />to build it with same steps</p><p>But I get the following in the compiling step triggered by make:</p><div class="codebox"><pre><code>wolfssh % make             
/Applications/Xcode.app/Contents/Developer/usr/bin/make -j9  all-am
  CC       src/libwolfssh_la-internal.lo
  CC       examples/client/client.o
  CC       examples/client/common.o
  CC       src/libwolfssh_la-ssh.lo
  CC       src/libwolfssh_la-log.lo
  CC       src/libwolfssh_la-port.lo
  CC       src/libwolfssh_la-io.lo
  CC       src/libwolfssh_la-wolfterm.lo
  CC       examples/echoserver/echoserver-echoserver.o
src/internal.c:2215:15: error: implicit declaration of function &#039;wc_SSH_KDF&#039; is invalid in C99 [-Werror,-Wimplicit-function-declaration]
        ret = wc_SSH_KDF(hashId, keyId, key, keySz,
              ^
1 error generated.
make[1]: *** [src/libwolfssh_la-internal.lo] Error 1
make[1]: *** Waiting for unfinished jobs....
make: *** [all] Error 2</code></pre></div>]]></description>
			<author><![CDATA[null@example.com (fredwolff)]]></author>
			<pubDate>Thu, 20 Feb 2025 19:49:21 +0000</pubDate>
			<guid>https://www.wolfssl.com/forums/post8220.html#p8220</guid>
		</item>
	</channel>
</rss>
